{"text_format":"1","workbook":"xlsx","n_sheets":4,"sheets":["Présentation","Saisie Financement","Résultats Financiers","Matrice"],"not_rendered":{"charts":2,"images":0,"macros":0,"external_links":14,"defined_names":134,"comments":0,"pivot_tables":0},"unopened":[],"bounds":{"document_bytes":16777216,"sheet_cells":100000,"rows_first":2000,"rows_last":500,"rows_between":2000,"halvings":0,"cell_chars":16384,"cell_head_chars":4096},"cells_cut":0,"cells_raw":0,"read":"whole","date_system":"1900"}

{"sheet":"Présentation","index":0,"n_rows":23,"n_cols":10,"rows_kept":23,"cut":false,"hidden":false,"merged":[[22,2,22,13],[2,2,2,13],[5,2,5,7],[11,2,11,7],[21,2,21,7],[8,2,8,7],[6,2,6,13],[9,2,9,13],[5,8,5,13],[8,8,8,13],[11,8,11,13],[21,8,21,13]]}
[]
[]
[null,null,"Présentation"]
[]
[]
[null,null,"INTRODUCTION"]
[null,null,"Cet outil vient en complément du \"Guide de Financement de la Méthanisation\" mis à disposition pour les porteurs de projets de méthanisation agricole.\nIl permet de voir l'impact des différents paramètres de financement disponibles et l'impact financier sur un projet type."]
[]
[null,null,"GUIDE D'UTILISATION"]
[null,null,"Allez sur la feuille \"Saisie FINANCEMENT\" et sélectionnez les paramètres de votre projet dans les cases colorée en jaune : la débit de votre projet, le niveau de dette et la structure des fonds propres.\nLes résultats de votre projet appraissent dans la feuille \"Résultats Financiers\""]
[]
[null,null,"GLOSSAIRE"]
[null,null,null,"PS","Parts sociales",null,null,null,"CVAE :","Contribution sur la Valeur Ajoutée des Entreprises"]
[null,null,null,"Financement Participatif :","Financement approté par un organisme participatif",null,null,null,"CFE :","Cotisation Foncière des Entreprises"]
[null,null,null,"CCA :","Comptes courants d'associés",null,null,null,"TRI projet* :","Taux de Rentabilité Interne lié au projet privé d'IS"]
[null,null,null,"Obligations :","Titre financier de type dette privée",null,null,null,"TRI actionnaires :","Taux de Rentabilité Interne lié aux flux actionnaires"]
[null,null,null,"CA :","Chiffre d'Affaires",null,null,null,"DSCR :","(RBE - IS) / (P+I)"]
[null,null,null,"CAPEX :","Dépenses d'investissement",null,null,null,"RBE :","Résultat Brut d'Exploitation"]
[null,null,null,"OPEX :","Charges opérationnelles",null,null,null,"IS : ","Impôt sur les sociétés"]
[null,null,null,null,null,null,null,null,"P + I : ","Service de la dette (principal et intérêts)"]
[]
[null,null,"AVERTISSEMENT"]
[null,null,"Cet outil rassemble les différentes simulations financières basées sur les paramètres économiques actuels et prévisionnels.\nIl intègre des \"cas-types\" préparamétrés, ainsi l'usage de cet outil amène l'utilisateur à se rapprocher du cas-type le plus représentatif de son projet, sans qu'il puisse être exactement similaire.\nLes résultats de cet outil donnent une orientation générale sur les solutions de financements possibles, ils ne sont pas représentatifs d'un projet ad'hoc et de ses spécificités."]

{"sheet":"Saisie Financement","index":1,"n_rows":19,"n_cols":12,"rows_kept":19,"cut":false,"hidden":false,"merged":[[7,7,8,7],[14,5,14,6],[15,5,15,6],[7,5,8,6]]}
[]
[]
[]
[]
[]
[null,{"$f":"IF(H8=50,IF(H11=0.8,IF(H15=1,1,IF(H15=2,2,IF(H15=3,3,IF(H15=4,4,)))),IF(H11=0.75,IF(H15=1,5,IF(H15=2,6,IF(H15=3,7,IF(H15=4,8,)))))),IF(H8=100,IF(H11=0.8,IF(H15=1,9,IF(H15=2,10,IF(H15=3,11,IF(H15=4,12,)))),IF(H11=0.75,IF(H15=1,13,IF(H15=2,14,IF(H15=3,15,IF(H15=4,16,))))))))","v":9},"Saisie Financement"]
[null,{"$f":"IF(H8=150,IF(H11=0.8,IF(H15=1,17,IF(H15=2,18,IF(H15=3,19,IF(H15=4,20,)))),IF(H11=0.75,IF(H15=1,21,IF(H15=2,22,IF(H15=3,23,IF(H15=4,24,)))))),IF(H8=200,IF(H11=0.8,IF(H15=1,25,IF(H15=2,26,IF(H15=3,27,IF(H15=4,28,)))),IF(H11=0.75,IF(H15=1,29,IF(H15=2,30,IF(H15=3,31,IF(H15=4,32,))))))))","v":false},"PARAMETRES PROJET",null,null,"CHOISISEZ LE DEBIT DE VOTRE INSTALLATION"]
[null,{"$f":"B7+B6","v":9},"Type de procédé  ","Agricole \nInfiniment Mélangé",null,"Débit nominal de biométhane \n(Nm3 CH4/h)",null,100,50,100,150,200]
[null,null,"Nb d'heure de fonctionnement",{"$f":"TEXT(HLOOKUP($B$8,Matrice!$C$4:$AN$71,14),\"# ##0\")","v":"8 200"}]
[null,null,"REPARTITION DES INTRANTS",null,null,"CHOISISSEZ VOTRE NIVEAU D'ENDETTEMENT (NET DES SUBVENTIONS)"]
[null,null,"CIVE",{"$f":"HLOOKUP($B$8,Matrice!$C$4:$AN$71,12)","v":0.4},null,null,"Dette bancaire",0.8,0.75,0.8]
[null,null,"Effluents d'elevage",{"$f":"HLOOKUP($B$8,Matrice!$C$4:$AN$71,13)","v":0.6},null,null,"Fonds propres ",{"$f":"1-H11","v":0.19999999999999996}]
[null,null,"Autres intrants",{"$f":"HLOOKUP($B$8,Matrice!$C$4:$AN$71,11)","v":0}]
[null,null,null,null,null,"CHOISISSEZ LA STRUCTURE DES FONDS PROPRES"]
[null,null,"TARIF  k€",{"$f":"TEXT(HLOOKUP($B$8,Matrice!$C$4:$AN$71,16),\"# ##0\")","v":"119"},null,"Choix du scénario",null,1,1,2,3,4]
[null,null,"CAPEX k€",{"$f":"\"~ \"&TEXT(ROUND(HLOOKUP($B$8,Matrice!$C$4:$AN$71,27),-2),\"# ##0\")","v":"~ 4 400"},null,"Apport du porteur de projet ",null,{"$f":"IF(H15=1,1,IF(H15=2,0.6,0.5))","v":1}]
[null,null,"CA k€/an",{"$f":"TEXT(HLOOKUP($B$8,Matrice!$C$4:$AN$71,22),\"# ##\")","v":"1 145"},null,null,"Financement participatif",{"$f":"IF(H15=3,0.1,IF(H15=4,0.1,0))","v":0}]
[null,null,"OPEX k€/an",{"$f":"TEXT(HLOOKUP($B$8,Matrice!$C$4:$AN$71,36),\"# ##0\")","v":"564"},null,null,"CCA tiers actionnaires",{"$f":"IF(H15=2,0.4,IF(H15=3,0.4,0))","v":0}]
[null,null,"SUBVENTIONS k€ (8% des CAPEX)",{"$f":"TEXT(HLOOKUP($B$8,Matrice!$C$4:$AN$71,59),\"# ##0\")","v":"355"},null,null,"SEM ou autre",{"$f":"IF(H15=4,0.4,0)","v":0}]

{"sheet":"Résultats Financiers","index":2,"n_rows":63,"n_cols":45,"rows_kept":63,"cut":false,"hidden":false,"merged":[[17,2,17,3],[19,2,19,3],[22,2,22,3],[2,2,7,10],[9,2,9,8],[10,2,10,12],[13,2,13,3],[15,2,15,3]]}
[]
[null,null,null,null,null,null,null,null,null,null,null,"PARAMETRES PROJET"]
[null,null,"Résultats Financiers",null,null,null,null,null,null,null,null,"Débit nominal de biométhane (Nm3 CH4/h)",{"$f":"'Saisie Financement'!H8","v":100}]
[null,null,null,null,null,null,null,null,null,null,null,{"$f":"'Saisie Financement'!G11","v":"Dette bancaire"},{"$f":"'Saisie Financement'!H11","v":0.8}]
[null,null,null,null,null,null,null,null,null,null,null,{"$f":"'Saisie Financement'!F16","v":"Apport du porteur de projet "},{"$f":"'Saisie Financement'!H16","v":1}]
[null,null,null,null,null,null,null,null,null,null,null,{"$f":"'Saisie Financement'!G17","v":"Financement participatif"},{"$f":"'Saisie Financement'!H17","v":0}]
[null,"Matrice",null,null,null,null,null,null,null,null,null,{"$f":"'Saisie Financement'!G18","v":"CCA tiers actionnaires"},{"$f":"'Saisie Financement'!H18","v":0}]
[null,{"$f":"'Saisie Financement'!B8","v":9},null,null,null,null,null,null,null,null,null,{"$f":"'Saisie Financement'!G19","v":"SEM ou autre"},{"$f":"'Saisie Financement'!H19","v":0}]
[]
[null,null,"AVERTISSEMENT"]
[null,null,"Cet outil rassemble les différentes simulations financières basées sur les paramètres économiques actuels et prévisionnels. Il intègre des \"cas-types\" préparamétrés, ainsi l'usage de cet outil amène l'utilisateur à se rapprocher du cas-type le plus représentatif de son projet, sans qu'il puisse être exactement similaire. Les résultats de cet outil donnent une orientation générale sur les solutions de financements possibles, ils ne sont pas représentatifs d'un projet ad'hoc et de ses spécificités."]
[]
[null,null,"CHIFFRES CLES",null,null,null,"DETTE BANCAIRES"]
[null,null,"TRI PROJET*",null,{"$f":"\"~ \"&TEXT(ROUND(HLOOKUP($B$8,Matrice!$C$4:$AN$71,68),2),\"0%\")","v":"~ 8%"}]
[]
[null,null,"TRI ACTIONNAIRES",null,{"$f":"\"~ \"&TEXT(ROUND(HLOOKUP($B$8,Matrice!$C$4:$AN$71,66),2),\"0%\")","v":"~ 18%"}]
[]
[null,null,"DSCR MOYEN",null,{"$f":"\"~ \"&TEXT(ROUND(AVERAGE(F44:Z44),1),\"0%\")","v":"~ 170%"}]
[]
[null,null,"DETTE  PRINCIPAL k€",null,{"$f":"\"~ \"&TEXT(ROUND(HLOOKUP($B$8,Matrice!$C$4:$AN$71,57),-2),\"# ##0\")","v":"~ 3 300"}]
[]
[null,null,null,null,null,null,"FLUX ACTIONNAIRES"]
[null,null,"TOTAL k€ PORTEUR DE PROJET",null,{"$f":"\"~ \"&TEXT(ROUND(SUM(F58:Z58)+SUM(F60:Z60)+SUM(F61:Z61)+SUM(F62:Z62)+SUM(F63:Z63),-2),\"# ##0\")","v":"~ 3 200"}]
[null,null,null,"DIVIDENDES  k€",{"$f":"\"~ \"&TEXT(ROUND(SUM(F58:Z58),-2),\"# ##0\")","v":"~ 1 900"}]
[null,null,null,"PS  k€",{"$f":"\"~ \"&TEXT(ROUND(SUM(F60:Z60)+SUM(F61:Z61),-2),\"# ##0\")","v":"~ 1 100"}]
[null,null,null,"SOLDE \nTRESORERIE  k€",{"$f":"\"~ \"&TEXT(ROUND(SUM(F62:Z62)+SUM(F63:Z63),-2),\"# ##0\")","v":"~ 300"}]
[]
[]
[]
[]
[]
[]
[]
[]
[]
[]
[]
[]
[]
[]
{"$rows_left_out":24}
{"sheet":"Matrice","index":3,"n_rows":790,"n_cols":43,"rows_kept":790,"cut":false,"hidden":true,"merged":[]}
[]
[]
[null,null,"CARACTERISTIQUES"]
["référence de simulation",null,1,2,3,4,5,6,7,8,null,null,9,10,11,12,13,14,15,16,null,null,17,18,19,20,21,22,23,24,null,null,25,26,27,28,29,30,31,32]
["Nm3 CH4/h",null,50,50,50,50,50,50,50,50,null,null,100,100,100,100,100,100,100,100,null,null,150,150,150,150,150,150,150,150,null,null,200,200,200,200,200,200,200,200]
[]
["procédé/marché",null,"Agricole IM","Agricole IM","Agricole IM","Agricole IM","Agricole IM","Agricole IM","Agricole IM","Agricole IM",null,null,"Agricole IM","Agricole IM","Agricole IM","Agricole IM","Agricole IM","Agricole IM","Agricole IM","Agricole IM",null,null,"Agricole IM","Agricole IM","Agricole IM","Agricole IM","Agricole IM","Agricole IM","Agricole IM","Agricole IM",null,null,"Agricole IM","Agricole IM","Agricole IM","Agricole IM","Agricole IM","Agricole IM","Agricole IM","Agricole IM"]
["durée de construction",null,1,1,1,1,1,1,1,1,null,null,1,1,1,1,1,1,1,1,null,null,1,1,1,1,1,1,1,1,null,null,1,1,1,1,1,1,1,1]
["durée d'opération",null,15,15,15,15,15,15,15,15,null,null,15,15,15,15,15,15,15,15,null,null,15,15,15,15,15,15,15,15,null,null,15,15,15,15,15,15,15,15]
["montée en charge année 1",null,0.7,0.7,0.7,0.7,0.7,0.7,0.7,0.7,null,null,0.7,0.7,0.7,0.7,0.7,0.7,0.7,0.7,null,null,0.7,0.7,0.7,0.7,0.7,0.7,0.7,0.7,null,null,0.7,0.7,0.7,0.7,0.7,0.7,0.7,0.7]
[]
[null,null,"METRIQUES"]
["tonnes/an",null,7246.376811594203,7246.376811594203,7246.376811594203,7246.376811594203,7246.376811594203,7246.376811594203,7246.376811594203,7246.376811594203,null,null,14492.753623188406,14492.753623188406,14492.753623188406,14492.753623188406,14492.753623188406,14492.753623188406,14492.753623188406,14492.753623188406,null,null,21739.130434782608,21739.130434782608,21739.130434782608,21739.130434782608,21739.130434782608,21739.130434782608,21739.130434782608,21739.130434782608,null,null,28985.507246376812,28985.507246376812,28985.507246376812,28985.507246376812,28985.507246376812,28985.507246376812,28985.507246376812,28985.507246376812]
["Autres intrants",null,0,0,0,0,0,0,0,0,null,null,0,0,0,0,0,0,0,0,null,null,0.3,0.3,0.3,0.3,0.3,0.3,0.3,0.3,null,null,0.3,0.3,0.3,0.3,0.3,0.3,0.3,0.3]
["CIVE",null,0.4,0.4,0.4,0.4,0.4,0.4,0.4,0.4,null,null,0.4,0.4,0.4,0.4,0.4,0.4,0.4,0.4,null,null,0.4,0.4,0.4,0.4,0.4,0.4,0.4,0.4,null,null,0.4,0.4,0.4,0.4,0.4,0.4,0.4,0.4]
["Effluents d'elevage",null,0.6,0.6,0.6,0.6,0.6,0.6,0.6,0.6,null,null,0.6,0.6,0.6,0.6,0.6,0.6,0.6,0.6,null,null,0.3,0.3,0.3,0.3,0.3,0.3,0.3,0.3,null,null,0.3,0.3,0.3,0.3,0.3,0.3,0.3,0.3]
["NHPP",null,8200,8200,8200,8200,8200,8200,8200,8200,null,null,8200,8200,8200,8200,8200,8200,8200,8200,null,null,8200,8200,8200,8200,8200,8200,8200,8200,null,null,8200,8200,8200,8200,8200,8200,8200,8200]
["MWh PCS/an",null,4469,4469,4469,4469,4469,4469,4469,4469,null,null,8938,8938,8938,8938,8938,8938,8938,8938,null,null,13407,13407,13407,13407,13407,13407,13407,13407,null,null,17876,17876,17876,17876,17876,17876,17876,17876]
["FIT",null,132,132,132,132,132,132,132,132,null,null,119.18064822859483,119.18064822859483,119.18064822859483,119.18064822859483,119.18064822859483,119.18064822859483,119.18064822859483,119.18064822859483,null,null,100.5320774726477,100.5320774726477,100.5320774726477,100.5320774726477,100.5320774726477,100.5320774726477,100.5320774726477,100.5320774726477,null,null,94.395818867251208,94.395818867251208,94.395818867251208,94.395818867251208,94.395818867251208,94.395818867251208,94.395818867251208,94.395818867251208]
["CA €HT",null,589908,589908,589908,589908,589908,589908,589908,589908,null,null,1065236.6338671807,1065236.6338671807,1065236.6338671807,1065236.6338671807,1065236.6338671807,1065236.6338671807,1065236.6338671807,1065236.6338671807,null,null,1347833.5626757876,1347833.5626757876,1347833.5626757876,1347833.5626757876,1347833.5626757876,1347833.5626757876,1347833.5626757876,1347833.5626757876,null,null,1687419.6580709827,1687419.6580709827,1687419.6580709827,1687419.6580709827,1687419.6580709827,1687419.6580709827,1687419.6580709827,1687419.6580709827]
[]
[null,null,"RECETTES"]
["Ventes CH4",null,589.90800000000002,589.90800000000002,589.90800000000002,589.90800000000002,589.90800000000002,589.90800000000002,589.90800000000002,589.90800000000002,null,null,1065.2366338671807,1065.2366338671807,1065.2366338671807,1065.2366338671807,1065.2366338671807,1065.2366338671807,1065.2366338671807,1065.2366338671807,null,null,1347.8335626757876,1347.8335626757876,1347.8335626757876,1347.8335626757876,1347.8335626757876,1347.8335626757876,1347.8335626757876,1347.8335626757876,null,null,1687.4196580709827,1687.4196580709827,1687.4196580709827,1687.4196580709827,1687.4196580709827,1687.4196580709827,1687.4196580709827,1687.4196580709827]
["Ventes digestat",null,0,0,0,0,0,0,0,0,null,null,79.831320320135589,79.831320320135589,79.831320320135589,79.831320320135589,79.831320320135589,79.831320320135589,79.831320320135589,79.831320320135589,null,null,100.97899757532632,100.97899757532632,100.97899757532632,100.97899757532632,100.97899757532632,100.97899757532632,100.97899757532632,100.97899757532632,null,null,125.53104109637269,125.53104109637269,125.53104109637269,125.53104109637269,125.53104109637269,125.53104109637269,125.53104109637269,125.53104109637269]
["TOTAL CA k€HT",null,589.90800000000002,589.90800000000002,589.90800000000002,589.90800000000002,589.90800000000002,589.90800000000002,589.90800000000002,589.90800000000002,null,null,1145.0679541873162,1145.0679541873162,1145.0679541873162,1145.0679541873162,1145.0679541873162,1145.0679541873162,1145.0679541873162,1145.0679541873162,null,null,1448.8125602511138,1448.8125602511138,1448.8125602511138,1448.8125602511138,1448.8125602511138,1448.8125602511138,1448.8125602511138,1448.8125602511138,null,null,1812.9506991673554,1812.9506991673554,1812.9506991673554,1812.9506991673554,1812.9506991673554,1812.9506991673554,1812.9506991673554,1812.9506991673554]
["Tonnage eq digestats",null,0,0,0,0,0,0,0,0,null,null,12281.741587713168,12281.741587713168,12281.741587713168,12281.741587713168,12281.741587713168,12281.741587713168,12281.741587713168,12281.741587713168,null,null,15535.23039620405,15535.23039620405,15535.23039620405,15535.23039620405,15535.23039620405,15535.23039620405,15535.23039620405,15535.23039620405,null,null,19312.46786098041,19312.46786098041,19312.46786098041,19312.46786098041,19312.46786098041,19312.46786098041,19312.46786098041,19312.46786098041]
["% vente digestat (cible 7%)",null,0,0,0,0,0,0,0,0,null,null,6.9717539494670341E-2,6.9717539494670341E-2,6.9717539494670341E-2,6.9717539494670341E-2,6.9717539494670341E-2,6.9717539494670341E-2,6.9717539494670341E-2,6.9717539494670341E-2,null,null,6.9697765153157037E-2,6.9697765153157037E-2,6.9697765153157037E-2,6.9697765153157037E-2,6.9697765153157037E-2,6.9697765153157037E-2,6.9697765153157037E-2,6.9697765153157037E-2,null,null,6.9241287782412439E-2,6.9241287782412439E-2,6.9241287782412439E-2,6.9241287782412439E-2,6.9241287782412439E-2,6.9241287782412439E-2,6.9241287782412439E-2,6.9241287782412439E-2]
[]
[null,null,"CAPEX"]
["Hard capex k€HT",null,2739.8346539071781,2739.8346539071781,2739.8346539071781,2739.8346539071781,2739.8346539071781,2739.8346539071781,2739.8346539071781,2739.8346539071781,null,null,4434.4033595299579,4434.4033595299579,4434.4033595299579,4434.4033595299579,4434.4033595299579,4434.4033595299579,4434.4033595299579,4434.4033595299579,null,null,5734.4429647542711,5734.4429647542711,5734.4429647542711,5734.4429647542711,5734.4429647542711,5734.4429647542711,5734.4429647542711,5734.4429647542711,null,null,6778.2748224911247,6778.2748224911247,6778.2748224911247,6778.2748224911247,6778.2748224911247,6778.2748224911247,6778.2748224911247,6778.2748224911247]
[]
[null,null,"OPEX"]
["Assurances",0.05,13.25,13.25,13.25,13.25,13.25,13.25,13.25,13.25,null,3.6655277331030932E-2,20.684572997900752,20.684572997900752,20.684572997900752,20.684572997900752,20.684572997900752,20.684572997900752,20.684572997900752,20.684572997900752,null,3.6655277331030932E-2,27.172867169773845,27.172867169773845,27.172867169773845,27.172867169773845,27.172867169773845,27.172867169773845,27.172867169773845,27.172867169773845,null,3.6655277331030932E-2,35.256116258042397,35.256116258042397,35.256116258042397,35.256116258042397,35.256116258042397,35.256116258042397,35.256116258042397,35.256116258042397]
["Maintenance - RH",0.376,99.64,99.64,99.64,99.64,99.64,99.64,99.64,99.64,null,0.41799999999999998,235.87739999999997,235.87739999999997,235.87739999999997,235.87739999999997,235.87739999999997,235.87739999999997,235.87739999999997,235.87739999999997,null,0.41799999999999998,309.86693605916349,309.86693605916349,309.86693605916349,309.86693605916349,309.86693605916349,309.86693605916349,309.86693605916349,309.86693605916349,null,0.41799999999999998,402.04460773199236,402.04460773199236,402.04460773199236,402.04460773199236,402.04460773199236,402.04460773199236,402.04460773199236,402.04460773199236]
["Honoraires",0.01,2.65,2.65,2.65,2.65,2.65,2.65,2.65,2.65,null,0.01,5.6429999999999998,5.6429999999999998,5.6429999999999998,5.6429999999999998,5.6429999999999998,5.6429999999999998,5.6429999999999998,5.6429999999999998,null,0.01,7.41308459471683,7.41308459471683,7.41308459471683,7.41308459471683,7.41308459471683,7.41308459471683,7.41308459471683,7.41308459471683,null,0.01,9.6182920510046017,9.6182920510046017,9.6182920510046017,9.6182920510046017,9.6182920510046017,9.6182920510046017,9.6182920510046017,9.6182920510046017]
["Réseaux et consommables",0.24,63.599999999999994,63.599999999999994,63.599999999999994,63.599999999999994,63.599999999999994,63.599999999999994,63.599999999999994,63.599999999999994,null,0.22919162604725432,129.33283457846559,129.33283457846559,129.33283457846559,129.33283457846559,129.33283457846559,129.33283457846559,129.33283457846559,129.33283457846559,null,0.22919162604725432,169.90169122890015,169.90169122890015,169.90169122890015,169.90169122890015,169.90169122890015,169.90169122890015,169.90169122890015,169.90169122890015,null,0.22919162604725432,220.44319949671254,220.44319949671254,220.44319949671254,220.44319949671254,220.44319949671254,220.44319949671254,220.44319949671254,220.44319949671254]
["Substrats et digestats",0.3,79.5,79.5,79.5,79.5,79.5,79.5,79.5,79.5,null,0.29267719538967107,165.15774135839138,165.15774135839138,165.15774135839138,165.15774135839138,165.15774135839138,165.15774135839138,165.15774135839138,165.15774135839138,null,0.29267719538967107,216.96408083680984,216.96408083680984,216.96408083680984,216.96408083680984,216.96408083680984,216.96408083680984,216.96408083680984,216.96408083680984,null,0.29267719538967107,281.5054741926794,281.5054741926794,281.5054741926794,281.5054741926794,281.5054741926794,281.5054741926794,281.5054741926794,281.5054741926794]
["Suivi d'Exploitation ",2.4E-2,6.36,6.36,6.36,6.36,6.36,6.36,6.36,6.36,null,1.3250327934887387E-2,7.4771600536569522,7.4771600536569522,7.4771600536569522,7.4771600536569522,7.4771600536569522,7.4771600536569522,7.4771600536569522,7.4771600536569522,null,1.3250327934887387E-2,9.8225801889059756,9.8225801889059756,9.8225801889059756,9.8225801889059756,9.8225801889059756,9.8225801889059756,9.8225801889059756,9.8225801889059756,null,1.3250327934887387E-2,12.744552384933158,12.744552384933158,12.744552384933158,12.744552384933158,12.744552384933158,12.744552384933158,12.744552384933158,12.744552384933158]
["TOTAL OPEX k€HT",1,265,265,265,265,265,265,265,265,null,0.99977442670284367,564.29999999999995,564.29999999999995,564.29999999999995,564.29999999999995,564.29999999999995,564.29999999999995,564.29999999999995,564.29999999999995,null,0.99977442670284367,741.30845947168302,741.30845947168302,741.30845947168302,741.30845947168302,741.30845947168302,741.30845947168302,741.30845947168302,741.30845947168302,null,0.99977442670284367,961.82920510046017,961.82920510046017,961.82920510046017,961.82920510046017,961.82920510046017,961.82920510046017,961.82920510046017,961.82920510046017]
["OPEX/CA %",null,0.44922259064125253,0.44922259064125253,0.44922259064125253,0.44922259064125253,0.44922259064125253,0.44922259064125253,0.44922259064125253,0.44922259064125253,null,null,0.52974145092193659,0.52974145092193659,0.52974145092193659,0.52974145092193659,0.52974145092193659,0.52974145092193659,0.52974145092193659,0.52974145092193659,null,null,0.54999999999999993,0.54999999999999993,0.54999999999999993,0.54999999999999993,0.54999999999999993,0.54999999999999993,0.54999999999999993,0.54999999999999993,null,null,0.56999999999999995,0.56999999999999995,0.56999999999999995,0.56999999999999995,0.56999999999999995,0.56999999999999995,0.56999999999999995,0.56999999999999995]
{"$rows_left_out":750}